rowid,id,uid,acheteur.id,acheteur.nom,nature,objet,codeCPV,lieuExecution.code,lieuExecution.typeCode,lieuExecution.nom,dureeMois,dateNotification,montant,titulaire.id,titulaire.typeIdentifiant,titulaire.denominationSociale,codeAPE,departement,categorie,categorieJuridique,categorieJuridiqueLibelle1,categorieJuridiqueLibelle2,etatEtablissement,etatEntreprise,longitude,latitude,donneesActuelles,anomalies
1232,20212021F0781500,1969177440001920212021F0781500,19691774400019,"Etablissements et organismes de l'enseignement supérieur, de la recherche et de l'innovation - UNIVERSITE CLAUDE BERNARD LYON 1",Marché,Acquisition d'un ellipsomètre pour le Laboratoire des Multimatériaux et Interfaces,38000000,69,Code département,(69) Rhône,7,2021-05-05,107691.0,75142084500016,SIRET,SEMILAB SEMICONDUCTOR PHYSICS LABORATORY LTD,46.69A,,PME,32,Personne morale de droit étranger,"Personne morale de droit étranger, non immatriculée au RCS",Actif,Active,,,oui,
1315,2021V191371-0200,210600888000152021V191371-0200,21060088800015,MAIRIE DE NICE,Accord-cadre,LOT 2 LOCATION MODULAIRES SPECIFIQUES POUR LES BESOINS RECURRENTS VILLE DE NICE,44211100-3,06364,Code postal,NICE,48,2021-01-18,333333330.0,38222441800014,SIRET,COUGNAUD SERVICES,77.39Z,85,ETI,57,Société commerciale,Société par actions simplifiée,Actif,Active,,,oui,
1379,20191801014L1N00,2197112720001920191801014L1N00,21971127200019,COLLECTIVITE DE SAINT-MARTIN,Accord-cadre,LOT 1N - FOURNITURES DE BUREAU,30192000-1,97054,Code postal,ST MARTIN CEDEX,48,2019-02-05,500000.0,48371508200028,SIRET,OFFICE FOURNITURES,47.62Z,97,PME,54,Société commerciale,Société à responsabilité limitée (SARL),Actif,Active,,,oui,
1381,20191801014L2N00,2197112720001920191801014L2N00,21971127200019,COLLECTIVITE DE SAINT-MARTIN,Accord-cadre,LOT 2N - FOURNITURES SCOLAIRES,39162110-9,97054,Code postal,ST MARTIN CEDEX,48,2019-02-05,150000.0,48371508200028,SIRET,OFFICE FOURNITURES,47.62Z,97,PME,54,Société commerciale,Société à responsabilité limitée (SARL),Actif,Active,,,oui,
1382,20191801014L4N00,2197112720001920191801014L4N00,21971127200019,COLLECTIVITE DE SAINT-MARTIN,Accord-cadre,LOT 4N - CONSOMMABLES INFORMATIQUES,30192000-1,97054,Code postal,ST MARTIN CEDEX,48,2019-02-05,50000.0,49258967600021,SIRET,SXM COPIEUR,47.78C,97,PME,54,Société commerciale,Société à responsabilité limitée (SARL),Actif,Active,,,oui,
1426,202002 L400,24260053400018202002 L400,24260053400018,EPCI COMMUNAUTE DE COMMUNES DIOIS,Marché,EXTENSION DE LA CHAMBRE FROIDE DE L'ABATTOIR DU DIOIS  LOT 4 : PLOMBERIE  FROID INDUSTRIEL,45000000-1,26150,Code postal,Die,12,2020-05-14,140993.0,32899872900045,SIRET,PROVENCE FROID,33.20B,04,PME,57,Société commerciale,Société par actions simplifiée,Actif,Active,,,oui,
1465,2021dKx8CeP6Wh00,266405521001102021dKx8CeP6Wh00,26640552100110,CENTRE HOSPITALIER DE PAU,Accord-cadre,DM UUS -offre,33140000,64,Code département,Pyrénées-Atlantiques,24,2021-05-05,212400.0,75500823200224,SIRET,MEDTRONIC,,,,,,,,,,,oui,
1584,2021151064635500,130014210000122021151064635500,13001421000012,"Ministère de la Transition Écologique, Ministère de la Cohésion des Territoires, Ministère de la Mer - Direction des Territoires, de l'Alimentation et de la Mer de Saint-Pierre et Miquelon",Marché,Un camion équipé d'une grue auxiliaire destiné à l’atelier quai de la DTAM,34100000,PM,Code département,(975) Saint-Pierre-et-Miquelon,9,2021-05-04,138990.0,88217010300015,SIRET,AUTO ACTION,45.32Z,97,,57,Société commerciale,Société par actions simplifiée,Actif,Active,,,oui,
1592,2021151063669500,179873013000172021151063669500,17987301300017,Ministère de l'Intérieur - Haut-Commissariat de la République en Polynésie Française,Marché,La présente consultation concerne l’exécution des prestations de travaux pour l’installation de panneaux photovoltaïques sur trois bâtiments du haut-commissariat.,9331200,PF,Code département,(987) Polynésie Française,6,2021-05-04,141812.84,0318491,HORS_UE,SIN TUNG HING / MAHANA ORA API,,,,,,,,,,,oui,
1612,2019U5RibqNP8e00,193113826000132019U5RibqNP8e00,19311382600013,Université Toulouse 1 - Capitole,Accord-cadre,2019-60-Lot 1 : Courants forts - Courants faibles (Sites de Toulouse),45200000,FR,Code pays,FRANCE,48,2020-03-02,2000000.0,44836172500022,SIRET,MAINTENANCE LOGISTIQUE RESEAU AUTOMAT,43.21A,31,PME,57,Société commerciale,Société par actions simplifiée,Actif,Active,,,oui,
1652,2020SXWEUmme9500,193113826000132020SXWEUmme9500,19311382600013,Université Toulouse 1 - Capitole,Accord-cadre,2020-18-Monographies imprimées éditées à l'étranger (sites de Toulouse et Rodez),22113000,31,Code département,Haute-Garonne,48,2020-11-27,400000.0,NL007025117B01,TVA_INTRACOMMUNAUTAIRE,ERASMUS,,,,,,,,,,,oui,
1665,20212021F0763700,1944098430001920212021F0763700,19440984300019,"Etablissements et organismes de l'enseignement supérieur, de la recherche et de l'innovation - UNIVERSITE DE NANTES",Marché,L'acquisition d’une caméra infrarouge performante pour le laboratoire de Thermique et Energie de Nantes (LTeN) permettra la mesure des champs de température en fonction du temps à différentes échelles et ceci sur une large gamme de température ( de 0° à 6,38126300,44,Code département,(44) Loire-Atlantique,24,2021-05-04,107784.0,BE-083573161000001,HORS_UE,FLIR Systems Trading Belgium BVBA,,,,,,,,,,,oui,
1668,2020DGAT20-00300,200014447000112020DGAT20-00300,20001444700011,SM GESTION ROUTES DE GUADELOUPE,Marché,"MOE POUR LA CONSTRUCTION DU NOUVEAU CENTRE ROUTIER DE POINTE-NOIRE, LE DESAMIANTAGE ET LA REHABILITATION DE L'ANCIEN BATIMENT",45210000-2,97122,Code postal,BAIE MAHAULT,36,2020-10-19,133000.0,34326719100017,SIRET,INGENIERIE PLUS,74.2C,97,PME,54,Société commerciale,Société à responsabilité limitée (SARL),Fermé,Active,,,oui,
1669,2020A14900,200027159000172020A14900,20002715900017,VILLE DE DUNKERQUE - PRINCIPAL,Accord-cadre,LOT 1 ENTRETIEN DES ORGUES DES EDIFICES CULTUELS,37311300-4,59183,Code commune,DUNKERQUE,48,2021-05-04,100000.0,BE0449126034,TVA,ORGUES DELMOTTE,,,,,,,,,,,oui,
1675,2021B04900,200027159000172021B04900,20002715900017,VILLE DE DUNKERQUE - PRINCIPAL,Accord-cadre,"Travaux d'entretien, de rénovation et de mise en conformité dans les bâtiments de la Ville de Dunkerque, du CCAS et de l'ADUGES - Lot 10 : Etanchéité",45260000-7,59183,Code commune,DUNKERQUE,21,2021-04-26,480000.0,68204083701638,SIRET,SMAC,43.99A,59,GE,57,Société commerciale,Société par actions simplifiée,Actif,Active,,,oui,
1697,2021WIN2000100,200041283000172021WIN2000100,20004128300017,CC PLAINE DU RHIN,Marché,AMENAGEMENT WINTZENBACH : RUE DU MOULIN ET DE GASSENBERG - VOIRIE - PROGRAMME 2021,45233123-7,67630,Code postal,LAUTERBOURG,2,2021-03-30,107790.7,50934962700026,SIRET,KLEIN TRAVAUX PUBLICS,42.11Z,67,GE,57,Société commerciale,Société par actions simplifiée,Actif,Active,,,oui,
1699,20211026100,2000537420001720211026100,20005374200017,REGION HDF PRINCIPAL,Marché,TRAVAUX DE REHAB DES BAT D INTERNAT LOT5 LYCEE AMYOT D INVILLE A SENLIS,45410000-4,HDF,Code région,HAUTS DE FRANCE,24,2021-04-28,381850.55,32516726000026,SIRET,CLOISONS ISOLATIONS PLAFONFS,43.29A,60,PME,57,Société commerciale,Société par actions simplifiée,Actif,Active,,,oui,
1726,2021DIP011200,200076958000122021DIP011200,20007695800012,1-DAP-SDM,Marché,"Numéro de la consultation : 2020-3DIP-0405 Programme de remplacement de garde-corps - Secteur Antenne SAINTE MARIE SICCHE RD83, RD183, RD228, RD28, RD69",45220000,20190,Code postal,Secteur Sainte Marie Sicché,6,2021-05-03,250000.0,45117863600010,SIRET,renucci et fils,43.99C,2A099,PME,54,Société commerciale,Société à responsabilité limitée (SARL),Actif,Active,,,oui,
1728,2020-03-0100,200087005000192020-03-0100,20008700500019,EPAGE DU BASSIN DU LOING,Accord-cadre,TRAVAUX D'URGENCE TRAITEMENT DE LA VEGETATION RIVULAIRE ET D'ENLEVEMENT D'EMBACLES - LOT1,01234567-0,45200,Code postal,Montargis,48,2020-09-16,80400.0,83841635200014,SIRET,REV FLEURY,,,,,,,,,,,oui,
1731,2020-03-0200,200087005000192020-03-0200,20008700500019,EPAGE DU BASSIN DU LOING,Accord-cadre,TRAVAUX D'URGENCE TRAITEMENT DE LA VEGETATION RIVULAIRE ET D'ENLEVEMENT D'EMBACLES - LOT2,01234567-0,45200,Code postal,Montargis,48,2020-09-16,80400.0,83841635200014,SIRET,REV FLEURY,,,,,,,,,,,oui,
1735,2020-03-0300,200087005000192020-03-0300,20008700500019,EPAGE DU BASSIN DU LOING,Accord-cadre,TRAVAUX D'URGENCE TRAITEMENT DE LA VEGETATION RIVULAIRE ET D'ENLEVEMENT D'EMBACLES - LOT3,01234567-0,45200,Code postal,Montargis,48,2020-09-16,80400.0,83841635200014,SIRET,REV FLEURY,,,,,,,,,,,oui,
1747,2020iveVWdIcjI00,210301909000112020iveVWdIcjI00,21030190900011,Mairie de Moulins,Marché,20024-20031-Electricité,45454100,03,Code département,Allier,5,2021-03-26,100708.06,44919482800025,SIRET,SARL TURLIER-GOZARD Electricit� g�n�rale,43.21A,03,PME,57,Société commerciale,Société par actions simplifiée,Actif,Active,,,oui,
1748,2020m9BINcuX4m00,210301909000112020m9BINcuX4m00,21030190900011,Mairie de Moulins,Marché,20024-20031-VRD,45454100,03,Code département,Allier,5,2021-03-25,18085.9,32933888303736,SIRET,COLAS,42.11Z,03,GE,57,Société commerciale,Société par actions simplifiée,Actif,Active,,,oui,
1751,2021EAyReQdoxL00,210301909000112021EAyReQdoxL00,21030190900011,Mairie de Moulins,Marché,21002-21007-Faux plafond,45321000,03,Code département,Allier,3,2021-03-25,54500.0,47999656300017,SIRET,SARL LES PLAFONDS DE MARC,43.31Z,03,PME,54,Société commerciale,Société à responsabilité limitée (SARL),Actif,Active,,,oui,
1757,2021gX9qnHbk_400,210301909000112021gX9qnHbk_400,21030190900011,Mairie de Moulins,Marché,21002-21007-Gros oeuvre,45321000,03,Code département,Allier,3,2021-03-25,11606.0,39266909900039,SIRET,SAS LASSOT,43.99C,03,PME,57,Société commerciale,Société par actions simplifiée,Actif,Active,,,oui,
1761,20212100800300,2106012330030220212100800300,21060123300302,Ville  de St Laurent du Var,Marché,SERRURERIE - PERGOLA,44316500-3,06700,Code postal,ST LAURENT DU VAR,16,2021-04-12,270575.17,ESB60760386,TVA,MICROARQUITECTURA,,,,,,,,,,,oui,
1842,2020GftqKQu0Tr00,219200490000152020GftqKQu0Tr00,21920049000015,Ville de Montrouge,Marché,2020-04 Séjours de vacances d'hiver 2021-Lot 2 : 6-12 ans ski tout niveau en Isère,55242000,92,Code département,Hauts-de-Seine,48,2020-10-21,28500.0,40351766700024,SIRET,Plein Temps Vacances et Loisirs,55.20Z,38,PME,92,Groupement de droit privé,Association loi 1901 ou assimilé,Actif,Active,,,oui,
1920,2021201812001900,220900013000162021201812001900,22090001300016,BUDGET PRINCIPAL,Marché subséquent,AMENAGEMENT DE LA RD 1 ENTRE VERNAJOUL ET LABOUICHE COMMUNES DE VERNAJOUL ET BAULOU,45233142-6,09329,Code commune,Vernajoul,4,2021-02-04,417812.6,30269887300106,SIRET,SPIE BATIGNOLLES MALET,42.11Z,09,GE,55,Société commerciale,Société anonyme à conseil d'administration,Actif,Active,,,oui,
1958,202020F05000,23971001500029202020F05000,23971001500029,BUDGET PRINCIPAL,Marché,TRANS SCO CANBT LYCEES AGRICOLE-BELAIRA1,60112000-6,971,Code région,GUADELOUPE,68,2020-04-20,57799.05,50039517300015,SIRET,SOFAVITA SARL,49.31Z,97,PME,54,Société commerciale,Société à responsabilité limitée (SARL),Actif,Active,,,oui,
1990,2021-STREMY00,257001594000492021-STREMY00,25700159400049,Budget eau Syndicat du Morillon,Marché,Renouvellement canalisation vétuste,45232151-5,70210,Code postal,SELLES,3,2020-10-29,230390.7,FR2767595003400016,TVA,LIVERA SA,,,,,,,,,,,oui,
1993,20212021S0803700,2621000760001320212021S0803700,26210007600013,CHU DIJON,Marché,MAINTENANCE LEVE PERSONNE ARJO,50324200,21,Code département,(21) Côte-d'Or,36,2021-05-04,15295.5,30521967700146,SIRET,ARJO FRANCE,46.46Z,59,ETI,57,Société commerciale,Société par actions simplifiée,Actif,Active,,,oui,
2005,20212021T0705400,2684001650001820212021T0705400,26840016500018,CH AVIGNON,Accord-cadre,"Travaux de second oeuvre : Cloisons, Faux-plafonds, Peintures et Sols - Peintures",45442100,84,Code département,(84) Vaucluse,48,2021-05-04,600000.0,44159766300021,SIRET,DG PEINTURE,,,,,,,,,,,oui,
2020,2021000020F02200,286912001000422021000020F02200,28691200100042,SDMIS,Accord-cadre,GLOG HABILLEMENT A VOCATION NON OPERATIONNELLE JSP SECTION MUSIQUE...,18300000-2,FRK26,Code département,RHONE,48,2021-02-03,280000.0,80184942300018,SIRET,BPI,14.12Z,52,PME,57,Société commerciale,Société par actions simplifiée,Actif,Active,,,oui,
2030,2020O0-Lpnr5OC00,352973622001812020O0-Lpnr5OC00,35297362200181,IMPRIMERIE NATIONALE SA,Accord-cadre,2020-72-2-Encres securisees et OVI,22610000,FR,Code pays,FRANCE,48,2020-12-21,1300000.0,CHE-105.732.246,HORS_UE,SICPA,,,,,,,,,,,oui,
2031,2020gSzoUn3Ek400,352973622001812020gSzoUn3Ek400,35297362200181,IMPRIMERIE NATIONALE SA,Accord-cadre,2020-72-1-Encres Sécurisées,22610000,FR,Code pays,FRANCE,48,2021-01-06,165000.0,FR49308528462,TVA_INTRACOMMUNAUTAIRE,Matériel Graphique Moderne,,,,,,,,,,,oui,
2087,2021100015368200,130014210000122021100015368200,13001421000012,"Ministère de la Transition Écologique, Ministère de la Cohésion des Territoires, Ministère de la Mer - Direction des Territoires, de l'Alimentation et de la Mer de Saint-Pierre et Miquelon",Marché,Fourniture d'un camion tandem équipé d'un bras hydraulique destiné à l'antenne de la DTAM à Miquelon,34100000,PM,Code département,(975) Saint-Pierre-et-Miquelon,9,2021-05-03,198700.0,37870453000013,SIRET,LOUIS HARDY SAS,46.71Z,97,PME,57,Société commerciale,Société par actions simplifiée,Actif,Active,,,oui,
2114,20212021S0770500,1800600300211720212021S0770500,18006003002117,"Ministère de la Transition Écologique, Ministère de la Cohésion des Territoires, Ministère de la Mer - Météo France",Accord-cadre,Entretien des espaces verts des parcs météorologiques de la zone d’observation du Sud-Ouest de Météo France.,77310000,09,Code département,(09) Ariège,48,2021-05-03,100000.0,84356166300001,HORS_UE,les coteaux des hauts de Gascogne entreprise,,,,,,,,,,,oui,
2121,20212021F0759000,1969177440001920212021F0759000,19691774400019,"Etablissements et organismes de l'enseignement supérieur, de la recherche et de l'innovation - UNIVERSITE CLAUDE BERNARD LYON 1",Marché,"L'Institut Lumière Matière situé à Villeurbanne (69100) sur le campus de la Doua, souhaite acquérir un spectromètre de type Czerny-Turner de 300-350 mm de focale environ, et d'une caméra iCCD dans le cadre d’un financement obtenu auprès de l’ANR. - Fourni",38433000,69,Code département,(69) Rhône,12,2021-05-03,18965.0,GB51718294400002,HORS_UE,Andor Technology LTD,,,,,,,,,,,oui,
2122,20212021F0759100,1969177440001920212021F0759100,19691774400019,"Etablissements et organismes de l'enseignement supérieur, de la recherche et de l'innovation - UNIVERSITE CLAUDE BERNARD LYON 1",Marché,"L'Institut Lumière Matière situé à Villeurbanne (69100) sur le campus de la Doua, souhaite acquérir un spectromètre de type Czerny-Turner de 300-350 mm de focale environ, et d'une caméra iCCD dans le cadre d’un financement obtenu auprès de l’ANR. - Fourni",38000000,69,Code département,(69) Rhône,12,2021-05-03,48456.0,GB51718294400002,HORS_UE,Andor Technology LTD,,,,,,,,,,,oui,
2129,20211026000,2000537420001720211026000,20005374200017,REGION HDF PRINCIPAL,Marché,TRAVAUX DE REHAB DES BAT D INTERNAT LOT4 LYCEE AMYOT D INVILLE A SENLIS,45421150-0,HDF,Code région,HAUTS DE FRANCE,24,2021-04-28,518526.64,34420375700028,SIRET,BHF DELAPLACE,41.20B,80,PME,57,Société commerciale,Société par actions simplifiée,Actif,Active,,,oui,
2130,20215DjiMYSjfc00,2000537670001420215DjiMYSjfc00,20005376700014,DTOUR - Direction du tourisme,Marché,DAF_2021_000062-Lot unique,71241000,69,Code département,Rhône,5,2021-04-30,200000.0,79777520200014,SIRET,ALTISENS,70.22Z,73,PME,54,Société commerciale,Société à responsabilité limitée (SARL),Actif,Active,,,oui,
2179,2021O45rxq_NbI00,211913009000182021O45rxq_NbI00,21191300900018,COMMUNE DE MAUSSAC,Marché,2021130VOI21M00-COMMUNE DE MAUSSAC (19250) : PROGRAMME TRAVAUX VOIRIE 2021,45233141,19,Code département,Corrèze,3,2021-05-03,113507.0,40632008500037,SIRET,Soci�t� R.M.C.L.,42.11Z,15,GE,55,Société commerciale,Société anonyme à conseil d'administration,Actif,Active,,,oui,
2180,2021V04100,212000046000122021V04100,21200004600012,Ville d'Ajaccio,Marché,Edition d'un catalogue et des supports de médiation relatifs à l'exposition temporaire:,22461000,20000,Code postal,Palais Fesch-musée des Beaux-Arts2 rue Jérôme Péri,1,2021-05-03,21750.0,04234970152,UE,SILVANA EDITORIALE,,,,,,,,,,,oui,
2201,2021TVX002-0100,214101982000122021TVX002-0100,21410198200012,COMMUNE DE SAINT AIGNAN,Marché,LOT 01 - VOIRIE RESEAUX DIVERS,77211600-8,41110,Code postal,Saint-Aignan,9,2021-03-15,497998.72,43360419600074,SIRET,EIFFAGE ROUTE ODF/CENTRE OUEST,42.11Z,37,GE,52,Société commerciale,Société en nom collectif,Actif,Active,,,oui,
2255,20212020.061L600,2197221390001720212020.061L600,21972213900017,VILLE DU LAMENTIN - 21972213900017,Marché,LOT6 CLIMATISATION,45331220-4,97232,Code postal,LE LAMENTIN,3,2021-01-11,63910.0,43885864900017,SIRET,IDEX ENERGIE ANTILLES,43.22B,97,ETI,57,Société commerciale,Société par actions simplifiée,Actif,Active,,,oui,
2264,202130045300,22250001900013202130045300,22250001900013,Département du Doubs,Marché,SECURISATION DES INSTALLATIONS DE CLIMATISATION EXISTANTE DU MUSEE COURBET A ORNANS ET CREATION DES RESERVES DU MUSEE COURBET A ORNANS PHASE 2 VITRINES ET SOCLES,45421000-4,25,Code département,LE DOUBS,15,2021-03-30,119520.0,IT01230150151,TVA,GOPPION SPA,,,,,,,,,,,oui,
2282,2020CP004F01905,224000018000162020CP004F01905,22400001800016,BUDGET PRINCIPAL CD40,Marché,COL GRENADE RESTRUCTURATION ET EXTENSION - BATIMENTS MODULAIRES,44211100-3,40,Code département,Département des Landes,23,2020-06-23,383599.31,38222441800014,SIRET,COUGNAUD SERVICES,77.39Z,85,ETI,57,Société commerciale,Société par actions simplifiée,Actif,Active,,,oui,
2291,2021CP017A00100,224000018000162021CP017A00100,22400001800016,BUDGET PRINCIPAL CD40,Accord-cadre,PRESTATIONS DE FAUCHAGE ET DE DEBROUSSAILLAGE DES ACCOTEMENTS ROUTIERS DU DEPARTEMENT DES LANDES LOT 1 UTD MORCENX,77310000-6,40,Code département,Département des Landes,15,2021-04-15,150000.0,80377731700030,SIRET,SB PAYSAGE,81.30Z,64,PME,54,Société commerciale,Société à responsabilité limitée (SARL),Actif,Active,,,oui,
2292,2021CP017A00200,224000018000162021CP017A00200,22400001800016,BUDGET PRINCIPAL CD40,Accord-cadre,PRESTATIONS DE FAUCHAGE ET DE DEBROUSSAILLAGE DES ACCOTEMENTS ROUTIERS DU DEPARTEMENT DES LANDES LOT 2 UTD SOUSTONS,77310000-6,40,Code département,Département des Landes,15,2021-04-15,50000.0,80377731700030,SIRET,SB PAYSAGE,81.30Z,64,PME,54,Société commerciale,Société à responsabilité limitée (SARL),Actif,Active,,,oui,
2293,202121T07500,22430001200016202121T07500,22430001200016,Département de la Haute-Loire,Marché,Numéro de la consultation : 2021-SBD-0004 Aménagement de la Maison de l'Autonomie dans un bâtiment existant au PUY EN VELAY - lots 6 et 8,45320000,43000,Code postal,Le Puy en Velay,18,2021-05-03,277502.68,48915807100055,SIRET,GAUTHIER,43.32A,43,ETI,57,Société commerciale,Société par actions simplifiée,Actif,Active,,,oui,
2305,202005204,22640001800876202005204,22640001800876,BUDGET PRINCIPAL,Marché,RENOVATION DES FACADES DU BATIMENT A DU COLLEGE JEANNE D'ALBRET A PAU - LOT 1 GROS OEUVRE REALCANALISATION DES BETONS,45000000-7,DEP,Code département,Département des Pyrénées-Atlantiques,22,2020-08-12,1187072.68,53270886400048,SIRET,R3S,43.99D,09,PME,57,Société commerciale,Société par actions simplifiée,Actif,Active,,,oui,
2385,20194md4JwXV4x00,3987290040001820194md4JwXV4x00,39872900400018,Troyes Habitat,Marché,2019-018-Bardage bois  Stratifié compact  Ossature métal,45262650,10,Code département,Aube,15,2019-05-03,91000.0,55288215100012,SIRET,LAMBERT MENUISERIE,43.32A,10,PME,57,Société commerciale,Société par actions simplifiée,Actif,Active,,,oui,
2389,201960bnG7RWsc00,39872900400018201960bnG7RWsc00,39872900400018,Troyes Habitat,Marché,2019-046-ETANCHEITE,45261420,10,Code département,Aube,15,2020-02-25,6774.0,52854326700017,SIRET,OBS ETANCHEITE,43.99A,10,PME,57,Société commerciale,Société par actions simplifiée,Actif,Active,,,oui,
2415,2019ItwgeT-l6S00,398729004000182019ItwgeT-l6S00,39872900400018,Troyes Habitat,Marché,2019-046-MENUISERIES EXTERIEURES,45421000,10,Code département,Aube,15,2020-02-25,66634.0,55288215100012,SIRET,LAMBERT MENUISERIE,43.32A,10,PME,57,Société commerciale,Société par actions simplifiée,Actif,Active,,,oui,
2446,2019Wy7KQBf04P00,398729004000182019Wy7KQBf04P00,39872900400018,Troyes Habitat,Marché,2019-010-MENUISERIES EXTERIEURES,45421000,10,Code département,Aube,14,2019-11-04,41862.0,55288215100012,SIRET,LAMBERT MENUISERIE,43.32A,10,PME,57,Société commerciale,Société par actions simplifiée,Actif,Active,,,oui,
2457,2019c7vV7964fR00,398729004000182019c7vV7964fR00,39872900400018,Troyes Habitat,Marché,2019-068-Menuiseries extérieures PVC,45421000,10,Code département,Aube,11,2020-02-20,46000.0,55288215100012,SIRET,LAMBERT MENUISERIE,43.32A,10,PME,57,Société commerciale,Société par actions simplifiée,Actif,Active,,,oui,
2458,2019cWMPkZG5xU00,398729004000182019cWMPkZG5xU00,39872900400018,Troyes Habitat,Marché,2019-046-PLOMBERIE  CHAUFFAGE  VMC  THERMODYNAMIQUE,45330000,10,Code département,Aube,15,2020-02-25,134202.38,49087390800019,SIRET,OBS PLOMBERIE,43.22A,10,PME,57,Société commerciale,Société par actions simplifiée,Actif,Active,,,oui,
2471,2019jfxM1hxuAn00,398729004000182019jfxM1hxuAn00,39872900400018,Troyes Habitat,Marché,2019-072-MENUISERIE EXTERIEURE,45000000,10,Code département,Aube,11,2021-03-10,51999.0,55288215100012,SIRET,LAMBERT MENUISERIE,43.32A,10,PME,57,Société commerciale,Société par actions simplifiée,Actif,Active,,,oui,
2478,2019mnRlbUz3JH00,398729004000182019mnRlbUz3JH00,39872900400018,Troyes Habitat,Marché,2019-018-Menuiseries extérieures aluminium et bois-alu,45421000,10,Code département,Aube,15,2019-05-03,91000.0,55288215100012,SIRET,LAMBERT MENUISERIE,43.32A,10,PME,57,Société commerciale,Société par actions simplifiée,Actif,Active,,,oui,
2480,2019muhZqx33Bk00,398729004000182019muhZqx33Bk00,39872900400018,Troyes Habitat,Marché,2019-047-Lot 1 : Remplacement de menuiseries extérieures en aluminium,45421000,10,Code département,Aube,6,2019-10-07,174169.0,55288215100012,SIRET,LAMBERT MENUISERIE,43.32A,10,PME,57,Société commerciale,Société par actions simplifiée,Actif,Active,,,oui,
2565,2020F9l-bAFAW000,967200049001122020F9l-bAFAW000,96720004900112,3F CENTRE VAL DE LOIRE,Marché,5294L-Lot 13 PEINTURE,45210000,28,Code département,Eure et Loir,15,2020-12-30,42498.0,FR9241398160600036,TVA_INTRACOMMUNAUTAIRE,BECHE,,,,,,,,,,,oui,
2609,2021100015264000,130001902002742021100015264000,13000190200274,Ministère des armées - Etablissement du service d'infrastructure de la défense de Lyon - ESID Lyon,Marché,"L’opération faisant l’objet de ce marché a pour but d’améliorer les performances énergétiques du site dans les conditions minimales suivantes : - - Gain de 31% sur consommations d’énergie finale relatives aux usages de chauffage, eau chaude sanitaire, ven",45200000,05,Code département,(05) Hautes-Alpes,240,2021-04-30,16093813.0,31587164000662,SIRET,IDEX ENERGIES,35.30Z,92,ETI,57,Société commerciale,Société par actions simplifiée,Actif,Active,,,oui,
2610,2021100015347200,130001902003322021100015347200,13000190200332,Ministère des armées - Etablissement du service d'infrastructure de la défense de Toulon - ESID Toulon,Marché subséquent,HYERES – 54ème RA – Stands de tir – Fourniture de granulats synthétiques pour l’année 2021 MS 4 à l'AC METZ 2020AM005039 -,44111520,83,Code département,(83) Var,1,2021-04-30,26240.0,045853265800001,HORS_UE,CK Technology,,,,,,,,,,,oui,
2622,2021130016500500,130013345000172021130016500500,13001334500017,"Ministère de l'Économie, des Finances et de la Relance - Sous-direction du cadre de vie",Marché,"Fourniture d'accès et d'utilisation de données de la société ICAP information services limited pour les services du ministère de l'économie, des finances et de la relance",72320000,22,Code département,(22) Côtes-d'Armor,44,2021-04-30,243826.29,0917533100001,HORS_UE,ICAP INFORMATION SERVICES LIMITED,,,,,,,,,,,oui,